BDBM114722 2-[(4-methylbenzyl)thio]-3H-imidazo[4,5-c]pyridine::2-[(4-methylphenyl)methylsulfanyl]-3H-imidazo[4,5-c]pyridine::2-[(4-methylphenyl)methylthio]-3H-imidazo[4,5-c]pyridine::MLS000522806::SMR000128072::cid_3551008
SMILES Cc1ccc(CSc2nc3ccncc3[nH]2)cc1
InChI Key InChIKey=AOGVVVMNQFKNIM-UHFFFAOYSA-N
Data  2 EC50
  Tab Delimited (TSV)   2D SDfile   Computed 3D by Vconf -m prep SDfile
Find this compound or compounds like it in BindingDB:
Activity Spreadsheet -- Enzyme Inhibition Constant Data from BindingDB
Found 1 hit for monomerid = 114722
TargetNuclear hormone receptor family member daf-12(Caenorhabditis elegans)
The Scripps Research Institute Molecular Screening Center
Curated by PubChem BioAssay
LigandPNGBDBM114722(2-[(4-methylbenzyl)thio]-3H-imidazo[4,5-c]pyridine...)
Affinity DataEC50:  6.75E+4nM. Assay description: Source (MLPCN Center Name): The Scripps Research Institute Molecular Screening Center (SRIMSC) Affiliation: The Scripps Research Institute, TSRI Assa...
In DepthDetails PCBioAssay